BDBM50142699 CHEMBL3759831
SMILES CCCC[C@@H]1NC(=O)[C@H](Cc2cccc3ccccc23)NC(=O)[C@H](CSSC[C@@H](NC1=O)C(O)=O)NC(=O)[C@@H](N)Cc1ccc(O)cc1
InChI Key InChIKey=LCOADPCHIJVFTI-MYHRABSESA-N
Data  2 KI  2 EC50
  Tab Delimited (TSV)   2D SDfile   Computed 3D by Vconf -m prep SDfile
Find this compound or compounds like it in BindingDB:
Activity Spreadsheet -- Enzyme Inhibition Constant Data from BindingDB
Found 4 hits for monomerid = 50142699
TargetMu-type opioid receptor(Rattus norvegicus (rat))
University Of Catania
Curated by ChEMBL
LigandPNGBDBM50142699(CHEMBL3759831)
Affinity DataKi:  3.70nM. Assay description: Displacement of [3H]diprenorphine from rat mu opioid receptor transfected in C6 cells by liquid scintillation counting assay
In DepthDetails ArticlePubMed
TargetDelta-type opioid receptor(Rattus norvegicus (rat))
University Of Catania
Curated by ChEMBL
LigandPNGBDBM50142699(CHEMBL3759831)
Affinity DataKi:  11nM. Assay description: Displacement of [3H]diprenorphine from rat delta opioid receptor transfected in C6 cells by liquid scintillation counting assay
In DepthDetails ArticlePubMed
TargetMu-type opioid receptor(Rattus norvegicus (rat))
University Of Catania
Curated by ChEMBL
LigandPNGBDBM50142699(CHEMBL3759831)
Affinity DataEC50:  5.10nM. Assay description: Agonist activity at rat mu opioid receptor transfected in C6 cells by [35S]GTPgammaS binding assay
In DepthDetails ArticlePubMed
TargetDelta-type opioid receptor(Rattus norvegicus (rat))
University Of Catania
Curated by ChEMBL
LigandPNGBDBM50142699(CHEMBL3759831)
Affinity DataEC50:  22nM. Assay description: Agonist activity at rat delta opioid receptor transfected in C6 cells by [35S]GTPgammaS binding assay
In DepthDetails ArticlePubMed