BDBM50143225 CHEMBL300762::N,N-Dibutyl-2-[5-chloro-2-(4-chloro-phenyl)-1H-indol-3-yl]-2-oxo-acetamide
SMILES CCCCN(CCCC)C(=O)C(=O)c1c([nH]c2ccc(Cl)cc12)-c1ccc(Cl)cc1
InChI Key InChIKey=WXPMBHGLFPGGNH-UHFFFAOYSA-N
Data  2 KI
  Tab Delimited (TSV)   2D SDfile   Computed 3D by Vconf -m prep SDfile
Find this compound or compounds like it in BindingDB:
Activity Spreadsheet -- Enzyme Inhibition Constant Data from BindingDB
Found 2 hits for monomerid = 50143225
TargetTranslocator protein(Rattus norvegicus (rat))
Niddk
Curated by ChEMBL
LigandPNGBDBM50143225(CHEMBL300762 | N,N-Dibutyl-2-[5-chloro-2-(4-chloro...)
Affinity DataKi:  1.90nM. Assay description: Displacement of [3H]-PK11195 from rat kidney mitochondrial membrane TSPO receptor assessed as inhibition constant
In DepthDetails PubMed
TargetTranslocator protein(Rattus norvegicus (rat))
Niddk
Curated by ChEMBL
LigandPNGBDBM50143225(CHEMBL300762 | N,N-Dibutyl-2-[5-chloro-2-(4-chloro...)
Affinity DataKi:  1.90nM. Assay description: Binding affinity to peripheral benzodiazepine receptors using [3H]-PK11195 radioligand in rat kidney mitochondrial membrane
In DepthDetails ArticlePubMed