BDBM50143301 (2-Hydroxy-ethyl)-dimethyl-octyl-ammonium::CHEMBL55754
SMILES CCCCCCCC[N+](C)(C)CCO
InChI Key InChIKey=OCAPHIRVDIMADR-UHFFFAOYSA-N
Data  2 KI
  Tab Delimited (TSV)   2D SDfile   Computed 3D by Vconf -m prep SDfile
Find this compound or compounds like it in BindingDB:
Activity Spreadsheet -- Enzyme Inhibition Constant Data from BindingDB
Found 2 hits for monomerid = 50143301
TargetSodium- and chloride-dependent creatine transporter 1(Rattus norvegicus)
Texas Tech University Health Sciences Center
Curated by ChEMBL
LigandPNGBDBM50143301((2-Hydroxy-ethyl)-dimethyl-octyl-ammonium | CHEMBL...)
Affinity DataKi:  2.10E+3nM. Assay description: Inhibition of [3H]choline brain uptake through choline transporter was determined in situ brain perfusion studies in Male Fischer-344 rats
In DepthDetails ArticlePubMed
TargetSodium- and chloride-dependent creatine transporter 1(Rattus norvegicus)
Texas Tech University Health Sciences Center
Curated by ChEMBL
LigandPNGBDBM50143301((2-Hydroxy-ethyl)-dimethyl-octyl-ammonium | CHEMBL...)
Affinity DataKi:  1.00E+4nM. Assay description: Binding affinity towards blood brain barrier choline transporter at 10 microM using rat brain
In DepthDetails ArticlePubMed