BDBM50143342 (S)-1-[2-(4-Bromo-phenyl)-5-oxo-oxazol-(4Z)-ylidenemethyl]-azetidine-2-carboxylic acid [(S)-1-carbamoyl-2-(4-hydroxy-phenyl)-ethyl]-amide::CHEMBL292003
SMILES NC(=O)[C@H](Cc1ccc(O)cc1)NC(=O)[C@@H]1CCN1\C=C1/N=C(OC1=O)c1ccc(Br)cc1
InChI Key InChIKey=NIZUASDYXIRVRV-ZSCLYBAYSA-N
Data  3 IC50
  Tab Delimited (TSV)   2D SDfile   Computed 3D by Vconf -m prep SDfile
Find this compound or compounds like it in BindingDB:
Activity Spreadsheet -- Enzyme Inhibition Constant Data from BindingDB
Found 3 hits for monomerid = 50143342
TargetMethionine--tRNA ligase, cytoplasmic(Homo sapiens (Human))
Arqule
Curated by ChEMBL
LigandPNGBDBM50143342((S)-1-[2-(4-Bromo-phenyl)-5-oxo-oxazol-(4Z)-yliden...)
Affinity DataIC50: >1.00E+5nM. Assay description: Inhibition of Enterococci faecalis methionyl-tRNA synthetase (EfMetRS)
In DepthDetails ArticlePubMed
TargetMethionine--tRNA ligase, cytoplasmic(Homo sapiens (Human))
Arqule
Curated by ChEMBL
LigandPNGBDBM50143342((S)-1-[2-(4-Bromo-phenyl)-5-oxo-oxazol-(4Z)-yliden...)
Affinity DataIC50:  1.40E+3nM. Assay description: Inhibition of Enterococci faecalis methionyl-tRNA synthetase (EfMetRS)
In DepthDetails ArticlePubMed
TargetMethionine--tRNA ligase, cytoplasmic(Homo sapiens (Human))
Arqule
Curated by ChEMBL
LigandPNGBDBM50143342((S)-1-[2-(4-Bromo-phenyl)-5-oxo-oxazol-(4Z)-yliden...)
Affinity DataIC50:  510nM. Assay description: Inhibition of Staphylococcus aureus methionyl-tRNA synthetase (SaMetRS)
In DepthDetails ArticlePubMed