BDBM50143367 CHEMBL58526::N*4*-Acridin-9-yl-N*1*,N*1*-diisopropyl-pentane-1,4-diamine
SMILES CC(CCCN(C(C)C)C(C)C)Nc1c2ccccc2nc2ccccc12
InChI Key InChIKey=KUOMZDQBXHUPGW-UHFFFAOYSA-N
Data  1 IC50
  Tab Delimited (TSV)   2D SDfile   Computed 3D by Vconf -m prep SDfile
Find this compound or compounds like it in BindingDB:
Activity Spreadsheet -- Enzyme Inhibition Constant Data from BindingDB
Found 1 hit for monomerid = 50143367
TargetVoltage-dependent calcium channel subunit alpha-2/delta-1(Homo sapiens (Human))
Merck Research Laboratories
Curated by ChEMBL
LigandPNGBDBM50143367(CHEMBL58526 | N*4*-Acridin-9-yl-N*1*,N*1*-diisopro...)
Affinity DataIC50: >1.00E+4nM. Assay description: Binding affinity towards alpha2-delta subunit of a voltage gated calcium channel using [3H]-gabapentin in human brain membrane (A710 membrane)
In DepthDetails ArticlePubMed