BDBM50143464 3,4-Dihydro-1H-isoquinoline-2-carboxylic acid (3R,5S)-5-[(S)-1-((S)-1-carboxy-2-phenyl-ethylaminooxalyl)-butylcarbamoyl]-1-((R)-3-methyl-2-{(R)-3-methyl-2-[(pyrazine-2-carbonyl)-amino]-butyrylamino}-butyryl)-pyrrolidin-3-yl ester::CHEMBL368378
SMILES CCC[C@H](NC(=O)[C@@H]1C[C@H](CN1C(=O)[C@H](NC(=O)[C@H](NC(=O)c1cnccn1)C(C)C)C(C)C)OC(=O)N1CCc2ccccc2C1)C(=O)C(=O)N[C@@H](Cc1ccccc1)C(O)=O
InChI Key InChIKey=NFHAZLUKVPHWIG-QYLWBKKLSA-N
Data  1 KI
  Tab Delimited (TSV)   2D SDfile   Computed 3D by Vconf -m prep SDfile
Find this compound or compounds like it in BindingDB:
Activity Spreadsheet -- Enzyme Inhibition Constant Data from BindingDB
Found 1 hit for monomerid = 50143464
TargetGenome polyprotein/Non-structural protein 4A(Hepatitis C virus)
Vertex Pharmaceuticals
Curated by ChEMBL
LigandPNGBDBM50143464(3,4-Dihydro-1H-isoquinoline-2-carboxylic acid (3R,...)
Affinity DataKi:  20nM. Assay description: Inhibitory activity against hepatitis C virus NS3.4A protease
In DepthDetails ArticlePubMed