BDBM50143636 4-methyl-N-[({5-[(1E)-7-chloroquinolin-2-yl)vinyl]-2-naphthyl}amino)carbonyl]benzenesulfonamide::CHEMBL293782
SMILES Cc1ccc(cc1)S(=O)(=O)NC(=O)Nc1ccc2c(\C=C\c3ccc4ccc(Cl)cc4n3)cccc2c1
InChI Key InChIKey=TYPYJAWFAUFRCW-DHZHZOJOSA-N
Data  1 IC50
  Tab Delimited (TSV)   2D SDfile   Computed 3D by Vconf -m prep SDfile
Find this compound or compounds like it in BindingDB:
Activity Spreadsheet -- Enzyme Inhibition Constant Data from BindingDB
Found 1 hit for monomerid = 50143636
TargetCapsid scaffolding protein(Human cytomegalovirus (strain AD169) (HHV-5) (Huma...)
Wyeth Research
Curated by ChEMBL
LigandPNGBDBM50143636(4-methyl-N-[({5-[(1E)-7-chloroquinolin-2-yl)vinyl]...)
Affinity DataIC50:  8.30nM. Assay description: Inhibitory concentration against HCMV protease.
In DepthDetails ArticlePubMed