BDBM50143807 CHEMBL3758698
SMILES NS(=O)(=O)c1ccc(cc1)-n1nc(ccc1=O)-c1ccc(Cc2ccccc2)cc1
InChI Key InChIKey=MLHPGRZXKSDTCE-UHFFFAOYSA-N
Data  2 KI
  Tab Delimited (TSV)   2D SDfile   Computed 3D by Vconf -m prep SDfile
Find this compound or compounds like it in BindingDB:
Activity Spreadsheet -- Enzyme Inhibition Constant Data from BindingDB
Found 2 hits for monomerid = 50143807
TargetCarbonic anhydrase 2(Homo sapiens (Human))
Jamia Hamdard (Hamdard University)
Curated by ChEMBL
LigandPNGBDBM50143807(CHEMBL3758698)
Affinity DataKi:  1.90nM. Assay description: Inhibition of human carbonic anhydrase-2 using p-nitrophenyl acetate as substrate by esterase assay
In DepthDetails ArticlePubMed
TargetCarbonic anhydrase 1(Homo sapiens (Human))
Jamia Hamdard (Hamdard University)
Curated by ChEMBL
LigandPNGBDBM50143807(CHEMBL3758698)
Affinity DataKi:  8.5nM. Assay description: Inhibition of human carbonic anhydrase-1 using p-nitrophenyl acetate as substrate by esterase assay
In DepthDetails ArticlePubMed