BDBM50144111 2-{4-(5-Chloro-1H-indole-2-sulfonyl)-1-[4-(1-methyl-4,5-dihydro-1H-imidazol-2-yl)-benzoyl]-piperazin-2-yl}-N-methyl-acetamide::CHEMBL303504
SMILES CNC(=O)CC1CN(CCN1C(=O)c1ccc(cc1)C1=NCCN1C)S(=O)(=O)c1cc2cc(Cl)ccc2[nH]1
InChI Key InChIKey=YGAJLSNNYBYKKC-UHFFFAOYSA-N
Data  1 IC50
  Tab Delimited (TSV)   2D SDfile   Computed 3D by Vconf -m prep SDfile
Find this compound or compounds like it in BindingDB:
Activity Spreadsheet -- Enzyme Inhibition Constant Data from BindingDB
Found 1 hit for monomerid = 50144111
TargetCoagulation factor X(Homo sapiens (Human))
Millennium Pharmaceuticals
Curated by ChEMBL
LigandPNGBDBM50144111(2-{4-(5-Chloro-1H-indole-2-sulfonyl)-1-[4-(1-methy...)
Affinity DataIC50:  11nM. Assay description: In vitro inhibitory activity against Coagulation factor X was determined
In DepthDetails ArticlePubMed