BDBM50144720 4-[2-Amino-6-(5-bromo-2-ethoxy-phenyl)-pyrimidin-4-ylamino]-benzamide::CHEMBL308100
SMILES CCOc1ccc(Br)cc1-c1cc(Nc2ccc(cc2)C(N)=O)nc(N)n1
InChI Key InChIKey=WBRJHLZKPTWHKZ-UHFFFAOYSA-N
Data  1 IC50
  Tab Delimited (TSV)   2D SDfile   Computed 3D by Vconf -m prep SDfile
Find this compound or compounds like it in BindingDB:
Activity Spreadsheet -- Enzyme Inhibition Constant Data from BindingDB
Found 1 hit for monomerid = 50144720
Target1-acyl-sn-glycerol-3-phosphate acyltransferase beta(Homo sapiens (Human))
Cell Therapeutics
Curated by ChEMBL
LigandPNGBDBM50144720(4-[2-Amino-6-(5-bromo-2-ethoxy-phenyl)-pyrimidin-4...)
Affinity DataIC50:  750nM. Assay description: Inhibitory activity against Lysophosphatidic acid acyltransferase-beta expressed in Sf9 insect cell membranes
In DepthDetails ArticlePubMed