BDBM50144814 2,3,5,6-Tetrafluoro-N-(4-sulfamoyl-phenyl)-benzamide::CHEMBL76563
SMILES NS(=O)(=O)c1ccc(NC(=O)c2c(F)c(F)cc(F)c2F)cc1
InChI Key InChIKey=ITJNRIXBXWTMBA-UHFFFAOYSA-N
Data  6 KI
  Tab Delimited (TSV)   2D SDfile   Computed 3D by Vconf -m prep SDfile
Find this compound or compounds like it in BindingDB:
Activity Spreadsheet -- Enzyme Inhibition Constant Data from BindingDB
Found 6 hits for monomerid = 50144814
TargetCarbonic anhydrase 9(Homo sapiens (Human))
Universit£
Curated by ChEMBL
LigandPNGBDBM50144814(2,3,5,6-Tetrafluoro-N-(4-sulfamoyl-phenyl)-benzami...)
Affinity DataKi:  15nM. Assay description: Inhibitory activity against human carbonic anhydrase IX
In DepthDetails ArticlePubMed
TargetCarbonic anhydrase 2(Homo sapiens (Human))
Universit£
Curated by ChEMBL
LigandPNGBDBM50144814(2,3,5,6-Tetrafluoro-N-(4-sulfamoyl-phenyl)-benzami...)
Affinity DataKi:  16nM. Assay description: In vitro inhibitory activity against human carbonic anhydrase II (hCAII)
In DepthDetails ArticlePubMed
TargetCarbonic anhydrase 2(Homo sapiens (Human))
Universit£
Curated by ChEMBL
LigandPNGBDBM50144814(2,3,5,6-Tetrafluoro-N-(4-sulfamoyl-phenyl)-benzami...)
Affinity DataKi:  16nM. Assay description: Inhibitory activity against human carbonic anhydrase II
In DepthDetails ArticlePubMed
TargetCarbonic anhydrase 4(Bos taurus (bovine))
Universit£
Curated by ChEMBL
LigandPNGBDBM50144814(2,3,5,6-Tetrafluoro-N-(4-sulfamoyl-phenyl)-benzami...)
Affinity DataKi:  400nM. Assay description: In vitro inhibitory activity against bovine carbonic anhydrase IV (CAIV)
In DepthDetails ArticlePubMed
TargetCarbonic anhydrase 1(Homo sapiens (Human))
Universit£
Curated by ChEMBL
LigandPNGBDBM50144814(2,3,5,6-Tetrafluoro-N-(4-sulfamoyl-phenyl)-benzami...)
Affinity DataKi:  975nM. Assay description: Inhibitory activity against human carbonic anhydrase I
In DepthDetails ArticlePubMed
TargetCarbonic anhydrase 1(Homo sapiens (Human))
Universit£
Curated by ChEMBL
LigandPNGBDBM50144814(2,3,5,6-Tetrafluoro-N-(4-sulfamoyl-phenyl)-benzami...)
Affinity DataKi:  975nM. Assay description: In vitro inhibitory activity against human carbonic anhydrase I (hCAI)
In DepthDetails ArticlePubMed