BDBM50144983 CHEMBL3763767
SMILES COc1cc2ncnc(-n3cnc(n3)-c3ccccn3)c2cc1OC
InChI Key InChIKey=FSNRXUIWODERSC-UHFFFAOYSA-N
Data  1 IC50
  Tab Delimited (TSV)   2D SDfile   Computed 3D by Vconf -m prep SDfile
Find this compound or compounds like it in BindingDB:
Activity Spreadsheet -- Enzyme Inhibition Constant Data from BindingDB
Found 1 hit for monomerid = 50144983
TargetSerine-protein kinase ATM(Homo sapiens (Human))
Duke University School Of Medicine
Curated by ChEMBL
LigandPNGBDBM50144983(CHEMBL3763767)
Affinity DataIC50:  5.30E+3nM. Assay description: Inhibition of ATM kinase in human MCF7 cells after 1 hr by immunofluorescence assay
In DepthDetails ArticlePubMed