BDBM50145182 CHEMBL3763955
SMILES Nc1nc2cc(ccc2c(=O)n1C[C@@H]1CC[C@@H](O1)c1ccc2ccccc2c1)-c1ccccc1
InChI Key InChIKey=GXRSTJMUWBFVLD-RPLLCQBOSA-N
Data  3 IC50
  Tab Delimited (TSV)   2D SDfile   Computed 3D by Vconf -m prep SDfile
Find this compound or compounds like it in BindingDB:
Activity Spreadsheet -- Enzyme Inhibition Constant Data from BindingDB
Found 3 hits for monomerid = 50145182
TargetPlasmepsin II(Plasmodium falciparum)
Latvian Institute Of Organic Synthesis
Curated by ChEMBL
LigandPNGBDBM50145182(CHEMBL3763955)
Affinity DataIC50:  2.50E+3nM. Assay description: Displacement of pepstatin A from recombinant Plasmodium falciparum plasmepsin 2 by NMR analysis
In DepthDetails ArticlePubMed
TargetCathepsin D(Homo sapiens (Human))
Latvian Institute Of Organic Synthesis
Curated by ChEMBL
LigandPNGBDBM50145182(CHEMBL3763955)
Affinity DataIC50:  1.95E+4nM. Assay description: Inhibition of CatD (unknown origin) preincubated for 30 mins followed by DABCYL-Glu-Arg-Nle-Phe-Leu-Ser-Phe-Pro-EDANS substrate addition by FRET assa...
In DepthDetails ArticlePubMed
TargetPlasmepsin I(Plasmodium falciparum)
Latvian Institute Of Organic Synthesis
Curated by ChEMBL
LigandPNGBDBM50145182(CHEMBL3763955)
Affinity DataIC50:  3.70E+3nM. Assay description: Inhibition of Plasmodium falciparum plasmepsin 1 preincubated for 30 mins followed by DABCYL-Glu-Arg-Nle-Phe-Leu-Ser-Phe-Pro-EDANS substrate addition...
In DepthDetails ArticlePubMed