BDBM50145192 CHEMBL3765653
SMILES CCCCCCC(=C)[C@@H](O)[C@H](C)C(=O)N1[C@H](COC1=O)C(C)C
InChI Key InChIKey=CUDWZXIFWQVCFD-ARFHVFGLSA-N
Data  1 IC50
  Tab Delimited (TSV)   2D SDfile   Computed 3D by Vconf -m prep SDfile
Find this compound or compounds like it in BindingDB:
Activity Spreadsheet -- Enzyme Inhibition Constant Data from BindingDB
Found 1 hit for monomerid = 50145192
TargetInterleukin-6 receptor subunit beta(Homo sapiens (Human))
Dongguk University-Seoul
Curated by ChEMBL
LigandPNGBDBM50145192(CHEMBL3765653)
Affinity DataIC50:  9.33E+3nM. Assay description: Inhibition of CDK2/Cyclin E (unknown origin) expressed in baculoviral infected insect Sf9 cells using histone H1 as substrate in presence of [gamma-3...
In DepthDetails ArticlePubMed