BDBM50145299 CHEMBL79423::Phenethyl-[6-([1,2,4]triazolo[3,4-a]phthalazin-6-yloxymethyl)-pyridin-2-ylmethyl]-amine
SMILES C(Cc1ccccc1)NCc1cccc(COc2nn3cnnc3c3ccccc23)n1
InChI Key InChIKey=BIJSBGFZBOFOLQ-UHFFFAOYSA-N
Data  1 IC50
  Tab Delimited (TSV)   2D SDfile   Computed 3D by Vconf -m prep SDfile
Find this compound or compounds like it in BindingDB:
Activity Spreadsheet -- Enzyme Inhibition Constant Data from BindingDB
Found 1 hit for monomerid = 50145299
TargetVoltage-dependent calcium channel subunit alpha-2/delta-1(Homo sapiens (Human))
Merck Research Laboratories
Curated by ChEMBL
LigandPNGBDBM50145299(CHEMBL79423 | Phenethyl-[6-([1,2,4]triazolo[3,4-a]...)
Affinity DataIC50:  230nM. Assay description: Binding affinity against alpha-2 delta-1 subunit of voltage gated subunit of Ca+2 channel in human
In DepthDetails ArticlePubMed