BDBM50145303 (2-p-Tolyl-ethyl)-[6-(3-trifluoromethyl-[1,2,4]triazolo[3,4-a]phthalazin-6-yloxymethyl)-pyridin-2-ylmethyl]-amine::CHEMBL79559
SMILES Cc1ccc(CCNCc2cccc(COc3nn4c(nnc4c4ccccc34)C(F)(F)F)n2)cc1
InChI Key InChIKey=AQHMVLCXVUMXCY-UHFFFAOYSA-N
Data  1 IC50
  Tab Delimited (TSV)   2D SDfile   Computed 3D by Vconf -m prep SDfile
Find this compound or compounds like it in BindingDB:
Activity Spreadsheet -- Enzyme Inhibition Constant Data from BindingDB
Found 1 hit for monomerid = 50145303
TargetVoltage-dependent calcium channel subunit alpha-2/delta-1(Homo sapiens (Human))
Merck Research Laboratories
Curated by ChEMBL
LigandPNGBDBM50145303((2-p-Tolyl-ethyl)-[6-(3-trifluoromethyl-[1,2,4]tri...)
Affinity DataIC50:  260nM. Assay description: Binding affinity against alpha2 delta-1 subunit of voltage-gated calcium channel in human.
In DepthDetails ArticlePubMed