BDBM50145320 CHEMBL315405::Methyl-phenethyl-[6-(3-trifluoromethyl-[1,2,4]triazolo[3,4-a]phthalazin-6-yloxymethyl)-pyridin-2-ylmethyl]-amine
SMILES CN(CCc1ccccc1)Cc1cccc(COc2nn3c(nnc3c3ccccc23)C(F)(F)F)n1
InChI Key InChIKey=ZICURJLMVIGHCT-UHFFFAOYSA-N
Data  1 IC50
  Tab Delimited (TSV)   2D SDfile   Computed 3D by Vconf -m prep SDfile
Find this compound or compounds like it in BindingDB:
Activity Spreadsheet -- Enzyme Inhibition Constant Data from BindingDB
Found 1 hit for monomerid = 50145320
TargetVoltage-dependent calcium channel subunit alpha-2/delta-1(Homo sapiens (Human))
Merck Research Laboratories
Curated by ChEMBL
LigandPNGBDBM50145320(CHEMBL315405 | Methyl-phenethyl-[6-(3-trifluoromet...)
Affinity DataIC50:  1.00E+4nM. Assay description: Binding affinity against alpha2 delta-1 subunit of voltage-gated calcium channel in human.
In DepthDetails ArticlePubMed