BDBM50145359 2-(3,4-Dihydroxy-benzylcarbamoyl)-8-hydroxy-quinoline-7-carboxylic acid::2-(3,4-dihydroxybenzylcarbamoyl)-8-hydroxyquinoline-7-carboxylic acid::CHEMBL81182
SMILES OC(=O)c1ccc2ccc(nc2c1O)C(=O)NCc1ccc(O)c(O)c1
InChI Key InChIKey=GFYMLRYNGZEAFF-UHFFFAOYSA-N
Data  2 IC50
  Tab Delimited (TSV)   2D SDfile   Computed 3D by Vconf -m prep SDfile
Find this compound or compounds like it in BindingDB:
Activity Spreadsheet -- Enzyme Inhibition Constant Data from BindingDB
Found 2 hits for monomerid = 50145359
TargetSerine/threonine-protein kinase pim-1(Homo sapiens (Human))
Universit£
Curated by ChEMBL
LigandPNGBDBM50145359(2-(3,4-Dihydroxy-benzylcarbamoyl)-8-hydroxy-quinol...)
Affinity DataIC50:  2.10E+3nM. Assay description: Inhibition of PIM1
In DepthDetails ArticlePubMed
TargetIntegrase(Human immunodeficiency virus 1)
Cnrs Umr 8076
Curated by ChEMBL
LigandPNGBDBM50145359(2-(3,4-Dihydroxy-benzylcarbamoyl)-8-hydroxy-quinol...)
Affinity DataIC50:  5.00E+3nM. Assay description: In vitro inhibition of recombinant integrase activity in a standard 3'-processing assay.
In DepthDetails ArticlePubMed