BDBM50145670 (S)-3-{(S)-4-Methyl-2-[2-(naphthalen-1-yloxy)-acetylamino]-pentanoylamino}-4-oxo-butyric acid::CHEMBL330535
SMILES CC(C)C[C@H](NC(=O)COc1cccc2ccccc12)C(=O)N[C@@H](CC(O)=O)C=O
InChI Key InChIKey=GCIXFQFILPSHQY-WMZOPIPTSA-N
Data  5 IC50
  Tab Delimited (TSV)   2D SDfile   Computed 3D by Vconf -m prep SDfile
Find this compound or compounds like it in BindingDB:
Activity Spreadsheet -- Enzyme Inhibition Constant Data from BindingDB
Found 5 hits for monomerid = 50145670
TargetCaspase-8(Homo sapiens (Human))
Idun Pharmaceuticals
Curated by ChEMBL
LigandPNGBDBM50145670((S)-3-{(S)-4-Methyl-2-[2-(naphthalen-1-yloxy)-acet...)
Affinity DataIC50:  770nM. Assay description: Binding affinity of the compound towards human Caspase-8
In DepthDetails ArticlePubMed
TargetCaspase-1(Mus musculus)
Idun Pharmaceuticals
Curated by ChEMBL
LigandPNGBDBM50145670((S)-3-{(S)-4-Methyl-2-[2-(naphthalen-1-yloxy)-acet...)
Affinity DataIC50:  570nM. Assay description: Binding affinity of the compound towards mouse Caspase-1
In DepthDetails ArticlePubMed
TargetCaspase-3(Homo sapiens (Human))
Idun Pharmaceuticals
Curated by ChEMBL
LigandPNGBDBM50145670((S)-3-{(S)-4-Methyl-2-[2-(naphthalen-1-yloxy)-acet...)
Affinity DataIC50:  135nM. Assay description: Binding affinity of the compound towards human Caspase-3
In DepthDetails ArticlePubMed
TargetCaspase-6(Homo sapiens (Human))
Idun Pharmaceuticals
Curated by ChEMBL
LigandPNGBDBM50145670((S)-3-{(S)-4-Methyl-2-[2-(naphthalen-1-yloxy)-acet...)
Affinity DataIC50:  940nM. Assay description: Binding affinity of the compound towards human Caspase-6
In DepthDetails ArticlePubMed
TargetCaspase-9(Homo sapiens (Human))
Idun Pharmaceuticals
Curated by ChEMBL
LigandPNGBDBM50145670((S)-3-{(S)-4-Methyl-2-[2-(naphthalen-1-yloxy)-acet...)
Affinity DataIC50:  2.72E+3nM. Assay description: Binding affinity of the compound towards human Caspase-9
In DepthDetails ArticlePubMed