BDBM50145743 1-(2-Bromo-phenyl)-1-(2-chloro-4-methyl-phenylamino)-4-phenyl-butan-2-one::CHEMBL81410
SMILES Cc1ccc(NC(C(=O)CCc2ccccc2)c2ccccc2Br)c(Cl)c1
InChI Key InChIKey=DCYOKNXAKWFFQI-UHFFFAOYSA-N
Data  1 KI
  Tab Delimited (TSV)   2D SDfile   Computed 3D by Vconf -m prep SDfile
Find this compound or compounds like it in BindingDB:
Activity Spreadsheet -- Enzyme Inhibition Constant Data from BindingDB
Found 1 hit for monomerid = 50145743
TargetCorticotropin-releasing factor receptor 1(Homo sapiens (Human))
Bristol-Myers Squibb Pharma Research Laboratories
Curated by ChEMBL
LigandPNGBDBM50145743(1-(2-Bromo-phenyl)-1-(2-chloro-4-methyl-phenylamin...)
Affinity DataKi: >1.00E+4nM. Assay description: Binding affinity towards human corticotropin releasing factor (h-CRF1) receptor
In DepthDetails ArticlePubMed