BDBM50145783 CHEMBL3764738
SMILES CC(C)CCc1ccc(cc1)-c1ccc2c(c1)nc(N)n(C[C@@H]1CC[C@@H](O1)c1ccccc1)c2=O
InChI Key InChIKey=WWPKSOZODYTMPO-LBNVMWSVSA-N
Data  3 IC50
  Tab Delimited (TSV)   2D SDfile   Computed 3D by Vconf -m prep SDfile
Find this compound or compounds like it in BindingDB:
Activity Spreadsheet -- Enzyme Inhibition Constant Data from BindingDB
Found 3 hits for monomerid = 50145783
TargetPlasmepsin II(Plasmodium falciparum)
Latvian Institute Of Organic Synthesis
Curated by ChEMBL
LigandPNGBDBM50145783(CHEMBL3764738)
Affinity DataIC50:  600nM. Assay description: Inhibition of Plasmodium falciparum plasmepsin 2 preincubated for 30 mins followed by DABCYL-Glu-Arg-Nle-Phe-Leu-Ser-Phe-Pro-EDANS substrate addition...
In DepthDetails ArticlePubMed
TargetCathepsin D(Homo sapiens (Human))
Latvian Institute Of Organic Synthesis
Curated by ChEMBL
LigandPNGBDBM50145783(CHEMBL3764738)
Affinity DataIC50: >1.00E+5nM. Assay description: Inhibition of CatD (unknown origin) preincubated for 30 mins followed by DABCYL-Glu-Arg-Nle-Phe-Leu-Ser-Phe-Pro-EDANS substrate addition by FRET assa...
In DepthDetails ArticlePubMed
TargetPlasmepsin I(Plasmodium falciparum)
Latvian Institute Of Organic Synthesis
Curated by ChEMBL
LigandPNGBDBM50145783(CHEMBL3764738)
Affinity DataIC50:  1.40E+3nM. Assay description: Inhibition of Plasmodium falciparum plasmepsin 1 preincubated for 30 mins followed by DABCYL-Glu-Arg-Nle-Phe-Leu-Ser-Phe-Pro-EDANS substrate addition...
In DepthDetails ArticlePubMed