BDBM50145810 (R)-2-Amino-3-(4-hydroxy-3,5-diiodo-phenyl)-propionic acid methyl ester::CHEMBL309770
SMILES COC(=O)[C@H](N)Cc1cc(I)c(O)c(I)c1
InChI Key InChIKey=TWUDQOSVGDGRHW-MRVPVSSYSA-N
Data  1 Kd
  Tab Delimited (TSV)   2D SDfile   Computed 3D by Vconf -m prep SDfile
Find this compound or compounds like it in BindingDB:
Activity Spreadsheet -- Enzyme Inhibition Constant Data from BindingDB
Found 1 hit for monomerid = 50145810
TargetGenome polyprotein(Hepatitis C virus)
Schering-Plough Research Institute
Curated by ChEMBL
LigandPNGBDBM50145810((R)-2-Amino-3-(4-hydroxy-3,5-diiodo-phenyl)-propio...)
Affinity DataKd: >2.50E+6nM. Assay description: Dissociation constant for HCV NS3 protease substrate binding site
In DepthDetails ArticlePubMed