BDBM50145813 3-(4-Amino-phenyl)-2-phenyl-propionic acid::CHEMBL310210
SMILES Nc1ccc(CC(C(O)=O)c2ccccc2)cc1
InChI Key InChIKey=XONFDEZWKOHVGX-UHFFFAOYSA-N
Data  1 Kd
  Tab Delimited (TSV)   2D SDfile   Computed 3D by Vconf -m prep SDfile
Find this compound or compounds like it in BindingDB:
Activity Spreadsheet -- Enzyme Inhibition Constant Data from BindingDB
Found 1 hit for monomerid = 50145813
TargetGenome polyprotein(Hepatitis C virus)
Schering-Plough Research Institute
Curated by ChEMBL
LigandPNGBDBM50145813(3-(4-Amino-phenyl)-2-phenyl-propionic acid | CHEMB...)
Affinity DataKd: >8.00E+6nM. Assay description: Dissociation constant for HCV NS3 protease substrate binding site
In DepthDetails ArticlePubMed