BDBM50146018 CHEMBL3349041
SMILES [H][C@]12Cc3cc(OC)c(OC)c(OC)c3-c3cc4OCOc4cc3C(=O)[C@@H]1COC2=O
InChI Key InChIKey=NWDPDRBNZCCUIU-UHFFFAOYSA-N
Data  2 KI
  Tab Delimited (TSV)   2D SDfile   Computed 3D by Vconf -m prep SDfile
Find this compound or compounds like it in BindingDB:
Activity Spreadsheet -- Enzyme Inhibition Constant Data from BindingDB
Found 2 hits for monomerid = 50146018
TargetTubulin beta chain(Sus scrofa)
TBA
Curated by ChEMBL
LigandPNGBDBM50146018(CHEMBL3349041)
Affinity DataKi:  1.78E+5nM. Assay description: Binding affinity against tubulin using [3H]colchicine as radioligand
In DepthDetails ArticlePubMed
TargetTubulin beta chain(Sus scrofa)
TBA
Curated by ChEMBL
LigandPNGBDBM50146018(CHEMBL3349041)
Affinity DataKi:  1.85E+5nM. Assay description: Binding affinity against tubulin usingf [3H]-colchicine as radioligand
In DepthDetails ArticlePubMed