BDBM50146088 CHEMBL3763929
SMILES OC[C@H]1O[C@@]2(CC(=NO2)c2ccc3OCOc3c2)[C@H](O)[C@@H](O)[C@@H]1O
InChI Key InChIKey=PABJJEAAACZXBV-UXXRCYHCSA-N
Data  4 IC50
  Tab Delimited (TSV)   2D SDfile   Computed 3D by Vconf -m prep SDfile
Find this compound or compounds like it in BindingDB:
Activity Spreadsheet -- Enzyme Inhibition Constant Data from BindingDB
Found 4 hits for monomerid = 50146088
TargetGlycogen phosphorylase, muscle form(Oryctolagus cuniculus (rabbit))
Universit£
Curated by ChEMBL
LigandPNGBDBM50146088(CHEMBL3763929)
Affinity DataIC50:  8.13E+4nM. Assay description: Inhibition of rabbit muscle glycogen phosphorylase b
In DepthDetails ArticlePubMed
TargetGlycogen phosphorylase, liver form(Homo sapiens (Human))
Universit£
Curated by ChEMBL
LigandPNGBDBM50146088(CHEMBL3763929)
Affinity DataIC50: >1.00E+5nM. Assay description: Inhibition of glycogen phosphorylase in human hepatocytes assessed as glucagon stimulated glycogen content after 3 hrs by colorimetric GOD method
In DepthDetails ArticlePubMed
TargetGlycogen phosphorylase, liver form(Homo sapiens (Human))
Universit£
Curated by ChEMBL
LigandPNGBDBM50146088(CHEMBL3763929)
Affinity DataIC50: >1.00E+5nM. Assay description: Inhibition of glycogen phosphorylase in human hepatocytes assessed as decrease in glucagon stimulated glucose release after 3 hrs by glucose oxidase ...
In DepthDetails ArticlePubMed
TargetGlycogen phosphorylase, liver form(Rattus norvegicus)
Universit£
Curated by ChEMBL
LigandPNGBDBM50146088(CHEMBL3763929)
Affinity DataIC50: >1.00E+5nM. Assay description: Inhibition of glycogen phosphorylase in Wistar rat hepatocytes assessed as decrease in glucagon stimulated glucose release after 3 hrs by glucose oxi...
In DepthDetails ArticlePubMed