BDBM50146122 4-{(E)-2-[({[2,4-Dichloro-3-(2-methyl-4-morpholin-4-yl-quinolin-8-yloxymethyl)-phenyl]-methyl-carbamoyl}-methyl)-carbamoyl]-vinyl}-N-methyl-benzamide; Dihydrochloride::CHEMBL544083
SMILES CNC(=O)c1ccc(\C=C\C(=O)NCC(=O)N(C)c2ccc(Cl)c(COc3cccc4c(cc(C)nc34)N3CCOCC3)c2Cl)cc1
InChI Key InChIKey=CJXKMHMEPMQQQZ-NTEUORMPSA-N
Data  2 IC50
  Tab Delimited (TSV)   2D SDfile   Computed 3D by Vconf -m prep SDfile
Find this compound or compounds like it in BindingDB:
Activity Spreadsheet -- Enzyme Inhibition Constant Data from BindingDB
Found 2 hits for monomerid = 50146122
TargetB2 bradykinin receptor(Homo sapiens (Human))
Fujisawa Pharmaceutical
Curated by ChEMBL
LigandPNGBDBM50146122(4-{(E)-2-[({[2,4-Dichloro-3-(2-methyl-4-morpholin-...)
Affinity DataIC50:  12nM. Assay description: Inhibition of specific binding of [3H]BK at 0.06 nM to bradykinin receptor B2 in guinea pig ileum membrane preparations by 50%.
In DepthDetails ArticlePubMed
TargetB2 bradykinin receptor(Homo sapiens (Human))
Fujisawa Pharmaceutical
Curated by ChEMBL
LigandPNGBDBM50146122(4-{(E)-2-[({[2,4-Dichloro-3-(2-methyl-4-morpholin-...)
Affinity DataIC50:  2.70nM. Assay description: Inhibition of specific binding of [3H]BK at 1 nM to human bradykinin receptor B2 expressed in CHO cells by 50%.
In DepthDetails ArticlePubMed