BDBM50146172 CHEMBL3763664
SMILES O=C(Nc1ccc2CCc3ccccc3N(C(=O)Cn3cccc3)c2c1)OC1CCC1
InChI Key InChIKey=LUFKWVILAVRFEZ-UHFFFAOYSA-N
Data  1 IC50
  Tab Delimited (TSV)   2D SDfile   Computed 3D by Vconf -m prep SDfile
Find this compound or compounds like it in BindingDB:
Activity Spreadsheet -- Enzyme Inhibition Constant Data from BindingDB
Found 1 hit for monomerid = 50146172
TargetNuclear receptor subfamily 1 group I member 3(Homo sapiens (Human))
St. Jude Children'S Research Hospital
Curated by ChEMBL
LigandPNGBDBM50146172(CHEMBL3763664)
Affinity DataIC50:  20nM. Assay description: Inverse agonist activity at GST tagged-human CAR-LBD assessed as reduction in fluorescein-PGC1 alpha coactivator recruitment after 1 hr by TR-FRET as...
In DepthDetails ArticlePubMed