BDBM50146242 3,4,5-Trimethoxy-benzoic acid 4-[(R)-2-((Z)-octadec-9-enoylamino)-3-phosphonooxy-propyl]-phenyl ester::CHEMBL313412
SMILES CCCCCCCC\C=C/CCCCCCCC(=O)N[C@@H](COP(O)(O)=O)Cc1ccc(OC(=O)c2cc(OC)c(OC)c(OC)c2)cc1
InChI Key InChIKey=MQBQSPXHYIAXMH-RPUPUBLZSA-N
Data  2 IC50
  Tab Delimited (TSV)   2D SDfile   Computed 3D by Vconf -m prep SDfile
Find this compound or compounds like it in BindingDB:
Activity Spreadsheet -- Enzyme Inhibition Constant Data from BindingDB
Found 2 hits for monomerid = 50146242
TargetLysophosphatidic acid receptor 1(Homo sapiens (Human))
University Of Virginia
Curated by ChEMBL
LigandPNGBDBM50146242(3,4,5-Trimethoxy-benzoic acid 4-[(R)-2-((Z)-octade...)
Affinity DataIC50: >1.00E+4nM. Assay description: In vitro ability to antagonize LPA-evoked [35S]-GTP-gammaS binding to lysophosphatidic acid receptor 1 in HEK293T cell lines
In DepthDetails ArticlePubMed
TargetLysophosphatidic acid receptor 3(Homo sapiens (Human))
University Of Virginia
Curated by ChEMBL
LigandPNGBDBM50146242(3,4,5-Trimethoxy-benzoic acid 4-[(R)-2-((Z)-octade...)
Affinity DataIC50:  427nM. Assay description: In vitro antagonism of LPA-evoked [35S]-GTP-gammaS binding to lysophosphatidic acid receptor 3 in HEK293T cell lines
In DepthDetails ArticlePubMed