BDBM50146353 4-[(3aR,12bS)-1-(3,3a,8,12b-Tetrahydro-2H-1-oxa-dibenzo[e,h]azulen-2-yl)methyl]-morpholine::CHEMBL96429
SMILES C(C1C[C@H]2[C@H](O1)c1ccccc1Cc1ccccc21)N1CCOCC1
InChI Key InChIKey=GPVDPKZTACUYNW-IPKCRJEZSA-N
Data  3 KI
  Tab Delimited (TSV)   2D SDfile   Computed 3D by Vconf -m prep SDfile
Find this compound or compounds like it in BindingDB:
Activity Spreadsheet -- Enzyme Inhibition Constant Data from BindingDB
Found 3 hits for monomerid = 50146353
TargetHistamine H1 receptor(Homo sapiens (Human))
Janssen-Cilag
Curated by ChEMBL
LigandPNGBDBM50146353(4-[(3aR,12bS)-1-(3,3a,8,12b-Tetrahydro-2H-1-oxa-di...)
Affinity DataKi:  2.40nM. Assay description: Ability to displace [3H]-pyrilamine from human cloned histamine H1 receptor expressed in CHO cells
In DepthDetails ArticlePubMed
Target5-hydroxytryptamine receptor 2C(Homo sapiens (Human))
Janssen-Cilag
Curated by ChEMBL
LigandPNGBDBM50146353(4-[(3aR,12bS)-1-(3,3a,8,12b-Tetrahydro-2H-1-oxa-di...)
Affinity DataKi:  27nM. Assay description: Ability to displace [3H]- mesulergine from human cloned 5-hydroxytryptamine 2C receptor expressed in CHO cells
In DepthDetails ArticlePubMed
Target5-hydroxytryptamine receptor 2A(Homo sapiens (Human))
Janssen-Cilag
Curated by ChEMBL
LigandPNGBDBM50146353(4-[(3aR,12bS)-1-(3,3a,8,12b-Tetrahydro-2H-1-oxa-di...)
Affinity DataKi:  433nM. Assay description: Ability to displace [125I]-R91150 from human cloned 5-hydroxytryptamine 2A receptor expressed in L929 cells
In DepthDetails ArticlePubMed