BDBM50146582 CHEMBL3764712
SMILES Cl.NOCCC1Cc2ccccc2C1
InChI Key InChIKey=ZUHFDMMFLMMALP-UHFFFAOYSA-N
Data  1 IC50
  Tab Delimited (TSV)   2D SDfile   Computed 3D by Vconf -m prep SDfile
Find this compound or compounds like it in BindingDB:
Activity Spreadsheet -- Enzyme Inhibition Constant Data from BindingDB
Found 1 hit for monomerid = 50146582
TargetIndoleamine 2,3-dioxygenase 1(Homo sapiens (Human))
Bryn Mawr College
Curated by ChEMBL
LigandPNGBDBM50146582(CHEMBL3764712)
Affinity DataIC50:  2.00E+4nM. Assay description: Inhibition of recombinant human IDO1 assessed as reduction in kynurenine production using L-tryptophan as substrate after 60 mins by microplate reade...
In DepthDetails ArticlePubMed