BDBM50146640 2-[4-(5-Chloro-pyridin-2-yloxy)-piperidine-1-sulfonylamino]-N-hydroxy-3-methyl-butyramide::CHEMBL92077
SMILES CC(C)C(NS(=O)(=O)N1CCC(CC1)Oc1ccc(Cl)cn1)C(=O)NO
InChI Key InChIKey=BMQVWLIVQKJCOL-UHFFFAOYSA-N
Data  1 IC50
  Tab Delimited (TSV)   2D SDfile   Computed 3D by Vconf -m prep SDfile
Find this compound or compounds like it in BindingDB:
Activity Spreadsheet -- Enzyme Inhibition Constant Data from BindingDB
Found 1 hit for monomerid = 50146640
TargetInterstitial collagenase(Homo sapiens (Human))
De Novo Pharmaceuticals
Curated by ChEMBL
LigandPNGBDBM50146640(2-[4-(5-Chloro-pyridin-2-yloxy)-piperidine-1-sulfo...)
Affinity DataIC50:  360nM. Assay description: Inhibition of human matrix metalloprotease-1
In DepthDetails ArticlePubMed