BDBM50146862 1-[4-Azido-5-(8-methyl-2-oxo-4H-2lambda*5*-benzo[1,3,2]dioxaphosphinin-2-yloxymethyl)-tetrahydro-furan-2-yl]-5-methyl-1H-pyrimidine-2,4-dione::CHEMBL97501
SMILES Cc1cccc2COP(=O)(OCC3OC(CC3N=[N+]=[N-])n3cc(C)c(=O)[nH]c3=O)Oc12
InChI Key InChIKey=NENSOAFAVKYDHT-UHFFFAOYSA-N
Data  5 IC50
  Tab Delimited (TSV)   2D SDfile   Computed 3D by Vconf -m prep SDfile
Find this compound or compounds like it in BindingDB:
Activity Spreadsheet -- Enzyme Inhibition Constant Data from BindingDB
Found 5 hits for monomerid = 50146862
TargetAcetylcholinesterase(Electrophorus electricus (Electric eel))
University Of Hamburg
Curated by ChEMBL
LigandPNGBDBM50146862(1-[4-Azido-5-(8-methyl-2-oxo-4H-2lambda*5*-benzo[1...)
Affinity DataIC50: >5.00E+4nM. Assay description: Inhibitory activity towards Electrophorus electricus acetylcholinesterase
In DepthDetails ArticlePubMed
TargetCholinesterase(Mus musculus (Mouse))
University Of Hamburg
Curated by ChEMBL
LigandPNGBDBM50146862(1-[4-Azido-5-(8-methyl-2-oxo-4H-2lambda*5*-benzo[1...)
Affinity DataIC50: >5.00E+4nM. Assay description: Inhibitory activity towards mouse butyrylcholinesterase
In DepthDetails ArticlePubMed
TargetCholinesterase(Homo sapiens (Human))
University Of Hamburg
Curated by ChEMBL
LigandPNGBDBM50146862(1-[4-Azido-5-(8-methyl-2-oxo-4H-2lambda*5*-benzo[1...)
Affinity DataIC50:  4.00E+4nM. Assay description: Inhibitory activity towards human butyrylcholinesterase
In DepthDetails ArticlePubMed
TargetAcetylcholinesterase(Bos taurus (bovine))
University Of Hamburg
Curated by ChEMBL
LigandPNGBDBM50146862(1-[4-Azido-5-(8-methyl-2-oxo-4H-2lambda*5*-benzo[1...)
Affinity DataIC50: >5.00E+4nM. Assay description: Inhibitory activity towards beef erythrocytes acetylcholinesterase
In DepthDetails ArticlePubMed
TargetAcetylcholinesterase(Bos taurus (bovine))
University Of Hamburg
Curated by ChEMBL
LigandPNGBDBM50146862(1-[4-Azido-5-(8-methyl-2-oxo-4H-2lambda*5*-benzo[1...)
Affinity DataIC50: >5.00E+4nM. Assay description: Inhibitory activity towards calf serum acetylcholinesterase
In DepthDetails ArticlePubMed