BDBM50146938 CHEMBL3764998
SMILES CN1CCN(CCCOc2ccc(cc2)N2C(=S)S\C(=C/c3ccc(Oc4ccc(Br)cc4)cc3)C2=O)CC1
InChI Key InChIKey=YTUVLTBJIMTVBQ-HFTWOUSFSA-N
Data  2 IC50
  Tab Delimited (TSV)   2D SDfile   Computed 3D by Vconf -m prep SDfile
Find this compound or compounds like it in BindingDB:
Activity Spreadsheet -- Enzyme Inhibition Constant Data from BindingDB
Found 2 hits for monomerid = 50146938
TargetInhibitor of nuclear factor kappa-B kinase subunit beta(Mus musculus)
The Catholic University Of Korea
Curated by ChEMBL
LigandPNGBDBM50146938(CHEMBL3764998)
Affinity DataIC50:  6.00E+3nM. Assay description: Inhibition of IKKbeta in primary type-2 collagen immunized mouse splenocytes assessed as inhibition of TNFalpha production at 10 uM after 72 hrs by E...
In DepthDetails ArticlePubMed
TargetInhibitor of nuclear factor kappa-B kinase subunit beta(Homo sapiens (Human))
The Catholic University Of Korea
Curated by ChEMBL
LigandPNGBDBM50146938(CHEMBL3764998)
Affinity DataIC50:  960nM. Assay description: Inhibition of IKKbeta (unknown origin) by TR-FRET assay
In DepthDetails ArticlePubMed