BDBM50146997 CHEMBL3765789
SMILES COc1cc2ncnc(Nc3cccc(NC(=O)C45CC6CC(CC(C6)C4)C5)c3)c2cc1OCCCN1CCOCC1
InChI Key InChIKey=PPURPCBFUCBUMT-UHFFFAOYSA-N
Data  2 IC50
  Tab Delimited (TSV)   2D SDfile   Computed 3D by Vconf -m prep SDfile
Find this compound or compounds like it in BindingDB:
Activity Spreadsheet -- Enzyme Inhibition Constant Data from BindingDB
Found 2 hits for monomerid = 50146997
TargetEpidermal growth factor receptor(Homo sapiens (Human))
Dalian Medical University
Curated by ChEMBL
LigandPNGBDBM50146997(CHEMBL3765789)
Affinity DataIC50:  3.10nM. Assay description: Inhibition of wild type recombinant human EGFR assessed as reduction in autophosphorylation of cytoplasmic domain by Z'-Lyte assay
In DepthDetails ArticlePubMed
TargetEpidermal growth factor receptor(Homo sapiens (Human))
Dalian Medical University
Curated by ChEMBL
LigandPNGBDBM50146997(CHEMBL3765789)
Affinity DataIC50:  159nM. Assay description: Inhibition of recombinant human EGFR L858R/T790M double mutant assessed as reduction in autophosphorylation of cytoplasmic domain by Z'-Lyte assay
In DepthDetails ArticlePubMed