BDBM50147040 3-[3-(2,6-Diisopropyl-phenyl)-ureido]-5-trifluoromethoxy-2,3,4,9-tetrahydro-1H-carbazole-3-carboxylic acid (1-pyridin-2-yl-cyclohexylmethyl)-amide::CHEMBL328166
SMILES CC(C)c1cccc(C(C)C)c1NC(=O)NC1(CCc2[nH]c3cccc(OC(F)(F)F)c3c2C1)C(=O)NCC1(CCCCC1)c1ccccn1
InChI Key InChIKey=XFUKUPKKDDBKAJ-UHFFFAOYSA-N
Data  1 IC50
  Tab Delimited (TSV)   2D SDfile   Computed 3D by Vconf -m prep SDfile
Find this compound or compounds like it in BindingDB:
Activity Spreadsheet -- Enzyme Inhibition Constant Data from BindingDB
Found 1 hit for monomerid = 50147040
TargetNeuromedin-B receptor(Homo sapiens (Human))
Tularik
Curated by ChEMBL
LigandPNGBDBM50147040(3-[3-(2,6-Diisopropyl-phenyl)-ureido]-5-trifluorom...)
Affinity DataIC50:  1.89E+3nM. Assay description: Affinity of [125I]-[D-Tyr0]-NMB to human Neuromedin B receptor expressed in HEK293 cells
In DepthDetails ArticlePubMed