BDBM50147118 (2-Hydroxy-cyclohexyl)-trimethyl-ammonium::CHEMBL318178
SMILES C[N+](C)(C)[C@@H]1CCCC[C@@H]1O
InChI Key InChIKey=YVFNMIFOQCYHSZ-BDAKNGLRSA-N
Data  1 KI
  Tab Delimited (TSV)   2D SDfile   Computed 3D by Vconf -m prep SDfile
Find this compound or compounds like it in BindingDB:
Activity Spreadsheet -- Enzyme Inhibition Constant Data from BindingDB
Found 1 hit for monomerid = 50147118
TargetSodium- and chloride-dependent creatine transporter 1(Rattus norvegicus)
Texas Tech University Health Sciences Center
Curated by ChEMBL
LigandPNGBDBM50147118((2-Hydroxy-cyclohexyl)-trimethyl-ammonium | CHEMBL...)
Affinity DataKi:  5.74E+5nM. Assay description: Inhibition of [3H]-choline brain uptake was determined by in situ brain perfusion studies in male rats
In DepthDetails ArticlePubMed