BDBM50147217 CHEMBL3763779
SMILES Cl.COc1ccccc1N1CCN(CCCCC(=O)n2c3ccccc3c3ccccc23)CC1
InChI Key InChIKey=XKAQRWFXAWNZKI-UHFFFAOYSA-N
Data  9 KI
  Tab Delimited (TSV)   2D SDfile   Computed 3D by Vconf -m prep SDfile
Find this compound or compounds like it in BindingDB:
Activity Spreadsheet -- Enzyme Inhibition Constant Data from BindingDB
Found 9 hits for monomerid = 50147217
Target5-hydroxytryptamine receptor 5A(Homo sapiens (Human))
Yonsei University
Curated by ChEMBL
LigandPNGBDBM50147217(CHEMBL3763779)
Affinity DataKi:  5nM. Assay description: Binding affinity to recombinant 5-HT5 receptor (unknown origin) after 1.5 hrs by radioligand displacement assay
In DepthDetails ArticlePubMed
Target5-hydroxytryptamine receptor 7(Homo sapiens (Human))
Yonsei University
Curated by ChEMBL
LigandPNGBDBM50147217(CHEMBL3763779)
Affinity DataKi:  30nM. Assay description: Displacement of [3H]LSD from 5-HT7 receptor (unknown origin) expressed in CHO-K1 cells by liquid scintillation counting method
In DepthDetails ArticlePubMed
Target5-hydroxytryptamine receptor 7(Homo sapiens (Human))
Yonsei University
Curated by ChEMBL
LigandPNGBDBM50147217(CHEMBL3763779)
Affinity DataKi:  30nM. Assay description: Binding affinity to recombinant 5-HT7 receptor (unknown origin) after 1.5 hrs by radioligand displacement assay
In DepthDetails ArticlePubMed
Target5-hydroxytryptamine receptor 2B(Homo sapiens (Human))
Yonsei University
Curated by ChEMBL
LigandPNGBDBM50147217(CHEMBL3763779)
Affinity DataKi:  93nM. Assay description: Binding affinity to recombinant 5-HT2B receptor (unknown origin) after 1.5 hrs by radioligand displacement assay
In DepthDetails ArticlePubMed
Target5-hydroxytryptamine receptor 1A(Homo sapiens (Human))
Yonsei University
Curated by ChEMBL
LigandPNGBDBM50147217(CHEMBL3763779)
Affinity DataKi:  122nM. Assay description: Binding affinity to recombinant 5-HT1A receptor (unknown origin) after 1.5 hrs by radioligand displacement assay
In DepthDetails ArticlePubMed
Target5-hydroxytryptamine receptor 2A(Homo sapiens (Human))
Yonsei University
Curated by ChEMBL
LigandPNGBDBM50147217(CHEMBL3763779)
Affinity DataKi:  451nM. Assay description: Binding affinity to recombinant 5-HT2A receptor (unknown origin) after 1.5 hrs by radioligand displacement assay
In DepthDetails ArticlePubMed
Target5-hydroxytryptamine receptor 1D(Homo sapiens (Human))
Yonsei University
Curated by ChEMBL
LigandPNGBDBM50147217(CHEMBL3763779)
Affinity DataKi:  462nM. Assay description: Binding affinity to recombinant 5-HT1D receptor (unknown origin) after 1.5 hrs by radioligand displacement assay
In DepthDetails ArticlePubMed
Target5-hydroxytryptamine receptor 2C(Homo sapiens (Human))
Yonsei University
Curated by ChEMBL
LigandPNGBDBM50147217(CHEMBL3763779)
Affinity DataKi:  1.17E+3nM. Assay description: Binding affinity to recombinant 5-HT2C receptor (unknown origin) after 1.5 hrs by radioligand displacement assay
In DepthDetails ArticlePubMed
Target5-hydroxytryptamine receptor 1B(Homo sapiens (Human))
Yonsei University
Curated by ChEMBL
LigandPNGBDBM50147217(CHEMBL3763779)
Affinity DataKi:  3.74E+3nM. Assay description: Binding affinity to recombinant 5-HT1B receptor (unknown origin) after 1.5 hrs by radioligand displacement assay
In DepthDetails ArticlePubMed