BDBM50147268 2-(4-(4-tert-butylphenyl)piperidine-1-carbonyl)-4-isopropyl-3-methylisoxazol-5(2H)-one::2-[4-(4-tert-Butyl-phenyl)-piperidine-1-carbonyl]-4-isopropyl-3-methyl-2H-isoxazol-5-one::CHEMBL107412
SMILES CC(C)c1c(C)n(oc1=O)C(=O)N1CCC(CC1)c1ccc(cc1)C(C)(C)C
InChI Key InChIKey=HRIDENLUHYQDNF-UHFFFAOYSA-N
Data  2 IC50
  Tab Delimited (TSV)   2D SDfile   Computed 3D by Vconf -m prep SDfile
Find this compound or compounds like it in BindingDB:
Activity Spreadsheet -- Enzyme Inhibition Constant Data from BindingDB
Found 2 hits for monomerid = 50147268
TargetHormone-sensitive lipase(Rattus norvegicus (Rat))
University Of Jordan
Curated by ChEMBL
LigandPNGBDBM50147268(2-(4-(4-tert-butylphenyl)piperidine-1-carbonyl)-4-...)
Affinity DataIC50:  480nM. Assay description: Inhibition of HSL in Wistar rat isolated fat cells by spectrophotometric assay
In DepthDetails ArticlePubMed
TargetHormone-sensitive lipase(Homo sapiens (Human))
Bayer Research Center
Curated by ChEMBL
LigandPNGBDBM50147268(2-(4-(4-tert-butylphenyl)piperidine-1-carbonyl)-4-...)
Affinity DataIC50:  480nM. Assay description: Inhibition of human recombinant hormone sensitive lipase (HSL)
In DepthDetails ArticlePubMed