BDBM50147576 Butyl-dimethyl-tetradecyl-ammonium; bromide::CHEMBL113172
SMILES CCCCCCCCCCCCCC[N+](C)(C)CCCC
InChI Key InChIKey=KWVRYCVTRIVEIP-UHFFFAOYSA-N
Data  1 IC50
  Tab Delimited (TSV)   2D SDfile   Computed 3D by Vconf -m prep SDfile
Find this compound or compounds like it in BindingDB:
Activity Spreadsheet -- Enzyme Inhibition Constant Data from BindingDB
Found 1 hit for monomerid = 50147576
TargetDynamin-1(Homo sapiens (Human))
The University Of Newcastle
Curated by ChEMBL
LigandPNGBDBM50147576(Butyl-dimethyl-tetradecyl-ammonium; bromide | CHEM...)
Affinity DataIC50:  8.02E+3nM. Assay description: Concentration required against dynamin-1 GTPase activity of sheep brain.
In DepthDetails ArticlePubMed