BDBM50147579 CHEMBL55860::OCTADECYLAMINE::Stearamine
SMILES CCCCCCCCCCCCCCCCCCN
InChI Key InChIKey=REYJJPSVUYRZGE-UHFFFAOYSA-N
Data  1 IC50
  Tab Delimited (TSV)   2D SDfile   Computed 3D by Vconf -m prep SDfile
Find this compound or compounds like it in BindingDB:
Activity Spreadsheet -- Enzyme Inhibition Constant Data from BindingDB
Found 1 hit for monomerid = 50147579
TargetDynamin-1(Homo sapiens (Human))
The University Of Newcastle
Curated by ChEMBL
LigandPNGBDBM50147579(CHEMBL55860 | OCTADECYLAMINE | Stearamine)
Affinity DataIC50:  2.82E+4nM. Assay description: Concentration required against dynamin-1 GTPase activity of sheep brain.
In DepthDetails ArticlePubMed