BDBM50147610 CHEMBL3765442
SMILES Cc1cc(=O)oc2cc(CNC3CCN(Cc4ccccc4)CC3)ccc12
InChI Key InChIKey=PDEVIVJKZGXTTC-UHFFFAOYSA-N
Data  3 IC50
  Tab Delimited (TSV)   2D SDfile   Computed 3D by Vconf -m prep SDfile
Find this compound or compounds like it in BindingDB:
Activity Spreadsheet -- Enzyme Inhibition Constant Data from BindingDB
Found 3 hits for monomerid = 50147610
TargetAmine oxidase [flavin-containing] B(Homo sapiens (Human))
China Pharmaceutical University
Curated by ChEMBL
LigandPNGBDBM50147610(CHEMBL3765442)
Affinity DataIC50:  1.93E+3nM. Assay description: Inhibition of human recombinant MAO-B using p-tyramine substrate after 15 mins by fluorimetric analysis
In DepthDetails ArticlePubMed
TargetAcetylcholinesterase(Electrophorus electricus (Electric eel))
China Pharmaceutical University
Curated by ChEMBL
LigandPNGBDBM50147610(CHEMBL3765442)
Affinity DataIC50:  7.28E+3nM. Assay description: Inhibition of electric eel AChE using acetylthiocholine iodide as substrate preincubated for 6 mins followed by substrate addition measured up to 180...
In DepthDetails ArticlePubMed
TargetCholinesterase(Equus caballus (Horse))
China Pharmaceutical University
Curated by ChEMBL
LigandPNGBDBM50147610(CHEMBL3765442)
Affinity DataIC50:  1.08E+4nM. Assay description: Inhibition of equine serum BuChE using S-butyrylthiocholine iodide as substrate preincubated for 6 mins followed by substrate addition measured up to...
In DepthDetails ArticlePubMed