BDBM50147697 CHEMBL3764470
SMILES Cc1nc2sccn2c1C(=O)NNC(=O)c1ccc(C)cc1
InChI Key InChIKey=UITKZDDUZOEFPO-UHFFFAOYSA-N
Data  1 IC50
  Tab Delimited (TSV)   2D SDfile   Computed 3D by Vconf -m prep SDfile
Find this compound or compounds like it in BindingDB:
Activity Spreadsheet -- Enzyme Inhibition Constant Data from BindingDB
Found 1 hit for monomerid = 50147697
TargetPantothenate synthetase(Mycobacterium tuberculosis (strain ATCC 25618 / H3...)
Birla Institute Of Technology
Curated by ChEMBL
LigandPNGBDBM50147697(CHEMBL3764470)
Affinity DataIC50:  4.99E+3nM. Assay description: Inhibition of Mycobacterium tuberculosis pantothenate synthetase using pantoic acid as substrate and beta-alanine as reactant assessed as NAD+ format...
In DepthDetails ArticlePubMed