BDBM50147727 CHEMBL3765386
SMILES Cc1nc2sccn2c1C(=O)NCc1ccccc1
InChI Key InChIKey=YAQXVWDTHJYPNE-UHFFFAOYSA-N
Data  1 IC50
  Tab Delimited (TSV)   2D SDfile   Computed 3D by Vconf -m prep SDfile
Find this compound or compounds like it in BindingDB:
Activity Spreadsheet -- Enzyme Inhibition Constant Data from BindingDB
Found 1 hit for monomerid = 50147727
TargetPantothenate synthetase(Mycobacterium tuberculosis (strain ATCC 25618 / H3...)
Birla Institute Of Technology
Curated by ChEMBL
LigandPNGBDBM50147727(CHEMBL3765386)
Affinity DataIC50:  1.06E+3nM. Assay description: Inhibition of Mycobacterium tuberculosis pantothenate synthetase using pantoic acid as substrate and beta-alanine as reactant assessed as NAD+ format...
In DepthDetails ArticlePubMed