BDBM50147801 CHEMBL102122::N-(5-Chloro-2-[1,2,4]triazol-1-yl-benzyl)-2-{3-[2,2-difluoro-2-(1-oxy-pyridin-2-yl)-ethylamino]-2-oxo-2H-pyrazin-1-yl}-acetamide
SMILES [O-][n+]1ccccc1C(F)(F)CNc1nccn(CC(=O)NCc2cc(Cl)ccc2-n2cncn2)c1=O
InChI Key InChIKey=NGCCYCZTUNKBJM-UHFFFAOYSA-N
Data  1 KI
  Tab Delimited (TSV)   2D SDfile   Computed 3D by Vconf -m prep SDfile
Find this compound or compounds like it in BindingDB:
Activity Spreadsheet -- Enzyme Inhibition Constant Data from BindingDB
Found 1 hit for monomerid = 50147801
TargetProthrombin(Homo sapiens (Human))
Merck Research Laboratories
Curated by ChEMBL
LigandPNGBDBM50147801(CHEMBL102122 | N-(5-Chloro-2-[1,2,4]triazol-1-yl-b...)
Affinity DataKi:  0.0850nM. Assay description: Inhibitory potency against human thrombin
In DepthDetails ArticlePubMed