BDBM50147901 2-Bromo-N-((R)-3,4,5-trihydroxy-6-hydroxymethyl-tetrahydro-pyran-2-yl)-acetamide::CHEMBL319465
SMILES OCC1O[C@@H](NC(=O)CBr)C(O)C(O)C1O
InChI Key InChIKey=FBDRYZFAXBPZEB-CWWBUFHZSA-N
Data  1 KI
  Tab Delimited (TSV)   2D SDfile   Computed 3D by Vconf -m prep SDfile
Find this compound or compounds like it in BindingDB:
Activity Spreadsheet -- Enzyme Inhibition Constant Data from BindingDB
Found 1 hit for monomerid = 50147901
TargetGlycogen phosphorylase, brain form(Homo sapiens (Human))
The University Of Illinois At Chicago
Curated by ChEMBL
LigandPNGBDBM50147901(2-Bromo-N-((R)-3,4,5-trihydroxy-6-hydroxymethyl-te...)
Affinity DataKi:  4.40E+4nM. Assay description: Inhibitory binding constant against glycogen phosphorylase B
In DepthDetails ArticlePubMed