BDBM50148233 4-[4-(4-Fluoro-benzyloxy)-benzenesulfonylamino]-tetrahydro-pyran-4-carboxylic acid hydroxyamide::CHEMBL114528
SMILES ONC(=O)C1(CCOCC1)NS(=O)(=O)c1ccc(OCc2ccc(F)cc2)cc1
InChI Key InChIKey=TWXMFJCBMYOHKC-UHFFFAOYSA-N
Data  2 IC50
  Tab Delimited (TSV)   2D SDfile   Computed 3D by Vconf -m prep SDfile
Find this compound or compounds like it in BindingDB:
Activity Spreadsheet -- Enzyme Inhibition Constant Data from BindingDB
Found 2 hits for monomerid = 50148233
TargetCollagenase 3(Homo sapiens (Human))
Pfizer
Curated by ChEMBL
LigandPNGBDBM50148233(4-[4-(4-Fluoro-benzyloxy)-benzenesulfonylamino]-te...)
Affinity DataIC50:  11nM. Assay description: Inhibitory activity against matrix metalloprotease-13 (MMP-13)
In DepthDetails ArticlePubMed
TargetInterstitial collagenase(Homo sapiens (Human))
Pfizer
Curated by ChEMBL
LigandPNGBDBM50148233(4-[4-(4-Fluoro-benzyloxy)-benzenesulfonylamino]-te...)
Affinity DataIC50:  6.50E+3nM. Assay description: Inhibitory activity against human matrix metalloprotease-1 (MMP-1)
In DepthDetails ArticlePubMed