BDBM50148313 ((S)-1-Formyl-pentyl)-carbamic acid (S)-1-benzyl-3-methyl-butyl ester::CHEMBL114904
SMILES CCCC[C@H](NC(=O)O[C@@H](CC(C)C)Cc1ccccc1)C=O
InChI Key InChIKey=GOQWVOOIFHZNJQ-ROUUACIJSA-N
Data  1 IC50
  Tab Delimited (TSV)   2D SDfile   Computed 3D by Vconf -m prep SDfile
Find this compound or compounds like it in BindingDB:
Activity Spreadsheet -- Enzyme Inhibition Constant Data from BindingDB
Found 1 hit for monomerid = 50148313
TargetCathepsin K(Homo sapiens (Human))
Glaxosmithkline
Curated by ChEMBL
LigandPNGBDBM50148313(((S)-1-Formyl-pentyl)-carbamic acid (S)-1-benzyl-3...)
Affinity DataIC50:  6.5nM. Assay description: Inhibitory concentration against recombinant human cathepsin K determined in a fluorescence assay using 10 microM Cbz-Phe-Arg-AMC as substrate
In DepthDetails ArticlePubMed