BDBM50148369 1-Methoxy-5-((S)-3-methylamino-1-thiophen-2-yl-propoxy)-naphthalen-2-ol::CHEMBL325669
SMILES CNCC[C@H](Oc1cccc2c(OC)c(O)ccc12)c1cccs1
InChI Key InChIKey=JIMSUICOCSIKLE-KRWDZBQOSA-N
Data  3 KI
  Tab Delimited (TSV)   2D SDfile   Computed 3D by Vconf -m prep SDfile
Find this compound or compounds like it in BindingDB:
Activity Spreadsheet -- Enzyme Inhibition Constant Data from BindingDB
Found 3 hits for monomerid = 50148369
TargetSodium-dependent serotonin transporter(Homo sapiens (Human))
Eli Lilly
Curated by ChEMBL
LigandPNGBDBM50148369(1-Methoxy-5-((S)-3-methylamino-1-thiophen-2-yl-pro...)
Affinity DataKi:  3.66nM. Assay description: Ability to inhibit [3H]-paroxetine binding to cloned human serototnin (5-HT) transporter; Average of two experiments
In DepthDetails ArticlePubMed
TargetSodium-dependent noradrenaline transporter(Homo sapiens (Human))
Eli Lilly
Curated by ChEMBL
LigandPNGBDBM50148369(1-Methoxy-5-((S)-3-methylamino-1-thiophen-2-yl-pro...)
Affinity DataKi:  235nM. Assay description: Ability to inhibit [3H]-nisoxatine binding to cloned human norepinephrine (NE) transporter; Average of two experiments
In DepthDetails ArticlePubMed
TargetSodium-dependent dopamine transporter(Homo sapiens (Human))
Eli Lilly
Curated by ChEMBL
LigandPNGBDBM50148369(1-Methoxy-5-((S)-3-methylamino-1-thiophen-2-yl-pro...)
Affinity DataKi:  353nM. Assay description: Ability to inhibit [3H]-mazindol binding to cloned human dopamine (DA) transporter; Average of two experiments
In DepthDetails ArticlePubMed