BDBM50148501 (S)-N-(2-Chloro-phenyl)-2-[2-hydroxy-2-((R)-4-hydroxy-3-methanesulfonylamino-phenyl)-ethylamino]-2-(4-methoxy-phenyl)-propionamide::CHEMBL115424
SMILES COc1ccc(cc1)[C@](C)(NC[C@H](O)c1ccc(O)c(NS(C)(=O)=O)c1)C(=O)Nc1ccccc1Cl
InChI Key InChIKey=XRHAFQYWBBFUSR-ZCYQVOJMSA-N
Data  1 KI
  Tab Delimited (TSV)   2D SDfile   Computed 3D by Vconf -m prep SDfile
Find this compound or compounds like it in BindingDB:
Activity Spreadsheet -- Enzyme Inhibition Constant Data from BindingDB
Found 1 hit for monomerid = 50148501
TargetBeta-3 adrenergic receptor(Homo sapiens (Human))
Bristol-Myers Squibb Pharmaceutical Research Institute
Curated by ChEMBL
LigandPNGBDBM50148501((S)-N-(2-Chloro-phenyl)-2-[2-hydroxy-2-((R)-4-hydr...)
Affinity DataKi:  380nM. Assay description: Binding affinity towards human beta-3 adrenergic receptor expressed in CHO cells
In DepthDetails ArticlePubMed