BDBM50148554 CHEMBL3770598
SMILES CCOc1ccc(cc1NC(=O)c1cc(cc(c1)-c1ccoc1)C(O)=O)C(C)=O
InChI Key InChIKey=HEMBESATTQDKPY-UHFFFAOYSA-N
Data  1 IC50  6 Kd
  Tab Delimited (TSV)   2D SDfile   Computed 3D by Vconf -m prep SDfile
Find this compound or compounds like it in BindingDB:
Activity Spreadsheet -- Enzyme Inhibition Constant Data from BindingDB
Found 7 hits for monomerid = 50148554
TargetCREB-binding protein(Homo sapiens (Human))
University Of Z£Rich
Curated by ChEMBL
LigandPNGBDBM50148554(CHEMBL3770598)
Affinity DataKd:  170nM. Assay description: Competitive binding affinity to human His-tagged CREBBP expressed in T7 phage-infected Escherichia coli BL21(DE3) cells incubated for 1 hr by bromosc...
In DepthDetails ArticlePubMed
TargetBromodomain-containing protein 4(Homo sapiens (Human))
University Of Z£Rich
Curated by ChEMBL
LigandPNGBDBM50148554(CHEMBL3770598)
Affinity DataKd:  9.80E+3nM. Assay description: Competitive binding affinity to human BRD4 bromodomain 1 expressed in T7 phage-infected Escherichia coli BL21(DE3) cells incubated for 1 hr by bromos...
In DepthDetails ArticlePubMed
TargetBromodomain-containing protein 4(Homo sapiens (Human))
University Of Z£Rich
Curated by ChEMBL
LigandPNGBDBM50148554(CHEMBL3770598)
Affinity DataKd: >3.60E+4nM. Assay description: Competitive binding affinity to human BRD4 bromodomain 2 expressed in T7 phage-infected Escherichia coli BL21(DE3) cells incubated for 1 hr by bromos...
In DepthDetails ArticlePubMed
TargetCREB-binding protein(Homo sapiens (Human))
University Of Z£Rich
Curated by ChEMBL
LigandPNGBDBM50148554(CHEMBL3770598)
Affinity DataIC50:  1.00E+3nM. Assay description: Inhibition of human recombinant GST-tagged CREBBP using non acetylated ligand 1 as substrate incubated for 2 hrs by TR-FRET assay
In DepthDetails ArticlePubMed
TargetBromodomain-containing protein 2(Homo sapiens (Human))
University Of Z£Rich
Curated by ChEMBL
LigandPNGBDBM50148554(CHEMBL3770598)
Affinity DataKd:  2.40E+4nM. Assay description: Competitive binding affinity to human BRD2 bromodomain 2 expressed in T7 phage-infected Escherichia coli BL21(DE3) cells incubated for 1 hr by bromos...
In DepthDetails ArticlePubMed
TargetCREB-binding protein(Homo sapiens (Human))
University Of Z£Rich
Curated by ChEMBL
LigandPNGBDBM50148554(CHEMBL3770598)
Affinity DataKd:  300nM. Assay description: Binding affinity to human His-tagged CREBBP expressed in Escherichia coli BL21(DE3) cells by isothermal titration calorimetry
In DepthDetails ArticlePubMed
TargetBromodomain-containing protein 2(Homo sapiens (Human))
University Of Z£Rich
Curated by ChEMBL
LigandPNGBDBM50148554(CHEMBL3770598)
Affinity DataKd:  2.40E+4nM. Assay description: Competitive binding affinity to human BRD2 bromodomain 1 expressed in T7 phage-infected Escherichia coli BL21(DE3) cells incubated for 1 hr by bromos...
In DepthDetails ArticlePubMed